Reaction Details
TargetMu-type opioid receptor
LigandBDBM50058432
Substrate/Competitorn/a
Meas. Tech.ChEMBL_1459556 (CHEMBL3369356)
Ki 7.7±n/a nM
Citation Kormos, CMGichinga, MGMaitra, RRunyon, SPThomas, JBBrieaddy, LEMascarella, SWNavarro, HACarroll, FI Design, synthesis, and biological evaluation of (3R)-1,2,3,4-tetrahydro-7-hydroxy-N-[(1S)-1-[[(3R,4R)-4-(3-hydroxyphenyl)-3,4-dimethyl-1-piperidinyl]methyl]-2-methylpropyl]-3-isoquinolinecarboxamide (JDTic) analogues: in vitro pharmacology and ADME profile. J Med Chem57:7367-81 (2014) 
 
Mu-type opioid receptor
Name:Mu-type opioid receptor
Type:G Protein-Coupled Receptor (GPCR)
Mol. Mass.:44789.51
Organism:Homo sapiens (Human)
Description:P35372
Residue:400
BDBM50058432
NameBDBM50058432
Synonyms:CHEMBL3326796
TypeSmall organic molecule
Emp. Form.C22H35NO
Mol. Mass.329.5194
SMILESC[C@H]1CN(CC[C@H](O)C2CCCCC2)CC[C@@]1(C)c1ccccc1