Reaction Details
TargetCannabinoid receptor 1
LigandBDBM50058437
Substrate/Competitorn/a
Meas. Tech.ChEMBL_1459579 (CHEMBL3369614)
Ki 420±n/a nM
Citation Pinna, GCurzu, MMDore, ALazzari, PRuiu, SPau, AMurineddu, GPinna, GA Tricyclic pyrazoles part 7. Discovery of potent and selective dihydrothienocyclopentapyrazole derived CB2 ligands. Eur J Med Chem85:747-57 (2014) 
 
Cannabinoid receptor 1
Name:Cannabinoid receptor 1
Type:Enzyme
Mol. Mass.:52842.52
Organism:Mus musculus (Mouse)
Description:P47746
Residue:473
BDBM50058437
NameBDBM50058437
Synonyms:CHEMBL3329245
TypeSmall organic molecule
Emp. Form.C28H33N3OS
Mol. Mass.459.646
SMILESCc1csc2Cc3c(nn(Cc4ccc(C)cc4)c3-c12)C(=O)NC1[C@@]2(C)CCC(C2)C1(C)C