Reaction Details
TargetDNA topoisomerase 4 subunit B
LigandBDBM50058509
Substrate/Competitorn/a
Meas. Tech.ChEMBL_1448970 (CHEMBL3376317)
IC50 940±n/a nM
Citation Yule, IACzaplewski, LGPommier, SDavies, DTNarramore, SKFishwick, CW Pyridine-3-carboxamide-6-yl-ureas as novel inhibitors of bacterial DNA gyrase: structure based design, synthesis, SAR and antimicrobial activity. Eur J Med Chem86:31-8 (2014) 
 
DNA topoisomerase 4 subunit B
Name:DNA topoisomerase 4 subunit B
Type:Enzyme Subunit
Mol. Mass.:70233.03
Organism:Escherichia coli (strain K12)
Description:n/a
Residue:630
BDBM50058509
NameBDBM50058509
Synonyms:CHEMBL3329317
TypeSmall organic molecule
Emp. Form.C20H20N6O3
Mol. Mass.392.4112
SMILESCCNC(=O)Nc1cc(Nc2ccc(O)cc2)c(cn1)C(=O)Nc1cccnc1