Reaction Details
TargetCruzipain
LigandBDBM50058806
Substrate/Competitorn/a
Meas. Tech.ChEMBL_1451533 (CHEMBL3365054)
IC50 40±n/a nM
Citation Cardoso, MVde Siqueira, LRda Silva, EBCosta, LBHernandes, MZRabello, MMFerreira, RSda Cruz, LFMoreira, DRPereira, VRde Castro, MCBernhardt, PVLeite, AC 2-Pyridyl thiazoles as novel anti-Trypanosoma cruzi agents: structural design, synthesis and pharmacological evaluation. Eur J Med Chem86:48-59 (2014) 
 
Cruzipain
Name:Cruzipain
Type:Protein
Mol. Mass.:49831.41
Organism:Trypanosoma cruzi
Description:P25779
Residue:467
BDBM50058806
NameBDBM50058806
Synonyms:CHEMBL3329519
TypeSmall organic molecule
Emp. Form.C17H16N4OS
Mol. Mass.324.4
SMILESCOc1ccc(cc1)-c1csc(N\N=C(/C)c2ccccn2)n1