Reaction Details
TargetCarbonic anhydrase 2
LigandBDBM50058825
Substrate/Competitorn/a
Meas. Tech.ChEMBL_1452411 (CHEMBL3362073)
Ki 1510±n/a nM
Citation Schwarz, SSommerwerk, SLucas, SDHeller, LCsuk, R Sulfamates of methyl triterpenoates are effective and competitive inhibitors of carbonic anhydrase II. Eur J Med Chem86:95-102 (2014) 
 
Carbonic anhydrase 2
Name:Carbonic anhydrase 2
Type:Enzyme Catalytic Domain
Mol. Mass.:29115.93
Organism:Bos taurus
Description:n/a
Residue:260
BDBM50058825
NameBDBM50058825
Synonyms:CHEMBL3325728
TypeSmall organic molecule
Emp. Form.C31H49NO6S
Mol. Mass.563.789
SMILES[H][C@@]12C[C@](C)(CC[C@]1(C)CC[C@]1(C)C2=CC(=O)[C@]2([H])[C@@]3(C)CC[C@H](OS(N)(=O)=O)C(C)(C)[C@]3([H])CC[C@@]12C)C(=O)OC