Reaction Details
TargetCarbonic anhydrase 2
LigandBDBM50058827
Substrate/Competitorn/a
Meas. Tech.ChEMBL_1452411 (CHEMBL3362073)
Ki 1740±n/a nM
Citation Schwarz, SSommerwerk, SLucas, SDHeller, LCsuk, R Sulfamates of methyl triterpenoates are effective and competitive inhibitors of carbonic anhydrase II. Eur J Med Chem86:95-102 (2014) 
 
Carbonic anhydrase 2
Name:Carbonic anhydrase 2
Type:Enzyme Catalytic Domain
Mol. Mass.:29115.93
Organism:Bos taurus
Description:n/a
Residue:260
BDBM50058827
NameBDBM50058827
Synonyms:CHEMBL3325865
TypeSmall organic molecule
Emp. Form.C30H49NO6S
Mol. Mass.551.778
SMILES[H][C@]12[C@@H](CC[C@@]1(CC[C@]1(C)[C@]2([H])CC[C@]2([H])[C@@]3(C)CC[C@H](OS(N)(=O)=O)C(C)(C)[C@]3([H])CC[C@@]12C)C(=O)OC)C(C)=O