Reaction Details
TargetProstaglandin G/H synthase 2
LigandBDBM11639
Substrate/Competitorn/a
Meas. Tech.ChEMBL_1452420 (CHEMBL3362082)
IC50 280±n/a nM
Citation Galal, SAKhairat, SHRagab, FAAbdelsamie, ASAli, MMSoliman, SMMortier, JWolber, GEl Diwani, HI Design, synthesis and molecular docking study of novel quinoxalin-2(1H)-ones as anti-tumor active agents with inhibition of tyrosine kinase receptor and studying their cyclooxygenase-2 activity. Eur J Med Chem86:122-32 (2014) 
 
Prostaglandin G/H synthase 2
Name:Prostaglandin G/H synthase 2
Type:Protein
Mol. Mass.:68976.98
Organism:Ovis aries (Sheep)
Description:n/a
Residue:603
BDBM11639
NameBDBM11639
Synonyms:4-[5-(4-methylphenyl)-3-(trifluoromethyl)-1H-pyrazol-1-yl]benzene-1-sulfonamide CLX Celecoxib US11478464, Compound Celecoxib US8741944, Comparative Compound cid_2662
TypeSmall organic molecule
Emp. Form.C17H14F3N3O2S
Mol. Mass.381.372
SMILESCc1ccc(cc1)-c1cc(nn1-c1ccc(cc1)S(N)(=O)=O)C(F)(F)F