Reaction Details
TargetInosine-5'-monophosphate dehydrogenase
LigandBDBM50100980
Substrate/Competitorn/a
Meas. Tech.ChEMBL_1452448 (CHEMBL3362472)
Ki 8.0±n/a nM
Citation Mandapati, KGorla, SKHouse, ALMcKenney, ESZhang, MRao, SNGollapalli, DRMann, BJGoldberg, JBCuny, GDGlomski, IJHedstrom, L Repurposing cryptosporidium inosine 5'-monophosphate dehydrogenase inhibitors as potential antibacterial agents. ACS Med Chem Lett5:846-50 (2014) 
 
Inosine-5'-monophosphate dehydrogenase
Name:Inosine-5'-monophosphate dehydrogenase
Type:PROTEIN
Mol. Mass.:52375.32
Organism:Bacillus anthracis
Description:ChEMBL_109471
Residue:487
BDBM50100980
NameBDBM50100980
Synonyms:CHEMBL2178617
TypeSmall organic molecule
Emp. Form.C19H21ClN4O3
Mol. Mass.388.848
SMILESC\C(=N/O)c1cccc(c1)C(C)(C)NC(=O)Nc1ccc(Cl)c(c1)C(N)=O