Reaction Details
TargetCarbonic anhydrase 9
LigandBDBM50058938
Substrate/Competitorn/a
Meas. Tech.ChEMBL_1456926 (CHEMBL3368143)
Ki 10±n/a nM
Citation Pala, NMicheletto, LSechi, MAggarwal, MCarta, FMcKenna, RSupuran, CT Carbonic Anhydrase Inhibition with Benzenesulfonamides and Tetrafluorobenzenesulfonamides Obtained via Click Chemistry. ACS Med Chem Lett5:927-30 (2014) 
 
Carbonic anhydrase 9
Name:Carbonic anhydrase 9
Type:Enzyme
Mol. Mass.:49669.03
Organism:Homo sapiens (Human)
Description:Catalytic domain of human cloned isozyme was used in the assay
Residue:459
BDBM50058938
NameBDBM50058938
Synonyms:CHEMBL3326419
TypeSmall organic molecule
Emp. Form.C9H7F4N5O2S
Mol. Mass.325.243
SMILESNCc1cn(nn1)-c1c(F)c(F)c(c(F)c1F)S(N)(=O)=O