Reaction Details
TargetCarbonic anhydrase 12
LigandBDBM50059073
Substrate/Competitorn/a
Meas. Tech.ChEMBL_1456927 (CHEMBL3368144)
Ki 12±n/a nM
Citation Pala, NMicheletto, LSechi, MAggarwal, MCarta, FMcKenna, RSupuran, CT Carbonic Anhydrase Inhibition with Benzenesulfonamides and Tetrafluorobenzenesulfonamides Obtained via Click Chemistry. ACS Med Chem Lett5:927-30 (2014) 
 
Carbonic anhydrase 12
Name:Carbonic anhydrase 12
Type:Enzyme
Mol. Mass.:39456.00
Organism:Homo sapiens (Human)
Description:Catalytic domain of human cloned isozyme was used in the assay
Residue:354
BDBM50059073
NameBDBM50059073
Synonyms:CHEMBL3326402
TypeSmall organic molecule
Emp. Form.C19H22N4O2S
Mol. Mass.370.469
SMILESCCCCCc1ccc(cc1)-c1cn(nn1)-c1ccc(cc1)S(N)(=O)=O