Reaction Details
TargetCarbonic anhydrase 12
LigandBDBM50059075
Substrate/Competitorn/a
Meas. Tech.ChEMBL_1456927 (CHEMBL3368144)
Ki 2.3±n/a nM
Citation Pala, NMicheletto, LSechi, MAggarwal, MCarta, FMcKenna, RSupuran, CT Carbonic Anhydrase Inhibition with Benzenesulfonamides and Tetrafluorobenzenesulfonamides Obtained via Click Chemistry. ACS Med Chem Lett5:927-30 (2014) 
 
Carbonic anhydrase 12
Name:Carbonic anhydrase 12
Type:Enzyme
Mol. Mass.:39456.00
Organism:Homo sapiens (Human)
Description:Catalytic domain of human cloned isozyme was used in the assay
Residue:354
BDBM50059075
NameBDBM50059075
Synonyms:CHEMBL3326404
TypeSmall organic molecule
Emp. Form.C11H13ClN4O2S
Mol. Mass.300.765
SMILESNS(=O)(=O)c1ccc(cc1)-n1cc(CCCCl)nn1