Reaction Details
TargetCarbonic anhydrase 2
LigandBDBM50059074
Substrate/Competitorn/a
Meas. Tech.ChEMBL_1456925 (CHEMBL3368142)
Ki 142±n/a nM
Citation Pala, NMicheletto, LSechi, MAggarwal, MCarta, FMcKenna, RSupuran, CT Carbonic Anhydrase Inhibition with Benzenesulfonamides and Tetrafluorobenzenesulfonamides Obtained via Click Chemistry. ACS Med Chem Lett5:927-30 (2014) 
 
Carbonic anhydrase 2
Name:Carbonic anhydrase 2
Type:Enzyme
Mol. Mass.:29250.71
Organism:Homo sapiens (Human)
Description:P00918
Residue:260
BDBM50059074
NameBDBM50059074
Synonyms:CHEMBL3326403
TypeSmall organic molecule
Emp. Form.C10H11BrN4O2S
Mol. Mass.331.189
SMILESNS(=O)(=O)c1ccc(cc1)-n1cc(CCBr)nn1