Reaction Details
TargetCarbonic anhydrase 2
LigandBDBM50059076
Substrate/Competitorn/a
Meas. Tech.ChEMBL_1456925 (CHEMBL3368142)
Ki 66±n/a nM
Citation Pala, NMicheletto, LSechi, MAggarwal, MCarta, FMcKenna, RSupuran, CT Carbonic Anhydrase Inhibition with Benzenesulfonamides and Tetrafluorobenzenesulfonamides Obtained via Click Chemistry. ACS Med Chem Lett5:927-30 (2014) 
 
Carbonic anhydrase 2
Name:Carbonic anhydrase 2
Type:Enzyme
Mol. Mass.:29250.71
Organism:Homo sapiens (Human)
Description:P00918
Residue:260
BDBM50059076
NameBDBM50059076
Synonyms:CHEMBL3326405
TypeSmall organic molecule
Emp. Form.C12H15ClN4O2S
Mol. Mass.314.791
SMILESNS(=O)(=O)c1ccc(cc1)-n1cc(CCCCCl)nn1