Reaction Details
TargetCarbonic anhydrase 2
LigandBDBM50059078
Substrate/Competitorn/a
Meas. Tech.ChEMBL_1456925 (CHEMBL3368142)
Ki 33±n/a nM
Citation Pala, NMicheletto, LSechi, MAggarwal, MCarta, FMcKenna, RSupuran, CT Carbonic Anhydrase Inhibition with Benzenesulfonamides and Tetrafluorobenzenesulfonamides Obtained via Click Chemistry. ACS Med Chem Lett5:927-30 (2014) 
 
Carbonic anhydrase 2
Name:Carbonic anhydrase 2
Type:Enzyme
Mol. Mass.:29250.71
Organism:Homo sapiens (Human)
Description:P00918
Residue:260
BDBM50059078
NameBDBM50059078
Synonyms:CHEMBL3326407
TypeSmall organic molecule
Emp. Form.C14H19N5O4S
Mol. Mass.353.397
SMILESCC(C)(C)OC(=O)NCc1cn(nn1)-c1ccc(cc1)S(N)(=O)=O