Reaction Details
TargetCarbonic anhydrase 9
LigandBDBM50059076
Substrate/Competitorn/a
Meas. Tech.ChEMBL_1456926 (CHEMBL3368143)
Ki 5.4±n/a nM
Citation Pala, NMicheletto, LSechi, MAggarwal, MCarta, FMcKenna, RSupuran, CT Carbonic Anhydrase Inhibition with Benzenesulfonamides and Tetrafluorobenzenesulfonamides Obtained via Click Chemistry. ACS Med Chem Lett5:927-30 (2014) 
 
Carbonic anhydrase 9
Name:Carbonic anhydrase 9
Type:Enzyme
Mol. Mass.:49669.03
Organism:Homo sapiens (Human)
Description:Catalytic domain of human cloned isozyme was used in the assay
Residue:459
BDBM50059076
NameBDBM50059076
Synonyms:CHEMBL3326405
TypeSmall organic molecule
Emp. Form.C12H15ClN4O2S
Mol. Mass.314.791
SMILESNS(=O)(=O)c1ccc(cc1)-n1cc(CCCCCl)nn1