Reaction Details
TargetCarbonic anhydrase 9
LigandBDBM15233
Substrate/Competitorn/a
Meas. Tech.ChEMBL_1456926 (CHEMBL3368143)
Ki 8.1±n/a nM
Citation Pala, NMicheletto, LSechi, MAggarwal, MCarta, FMcKenna, RSupuran, CT Carbonic Anhydrase Inhibition with Benzenesulfonamides and Tetrafluorobenzenesulfonamides Obtained via Click Chemistry. ACS Med Chem Lett5:927-30 (2014) 
 
Carbonic anhydrase 9
Name:Carbonic anhydrase 9
Type:Enzyme
Mol. Mass.:49669.03
Organism:Homo sapiens (Human)
Description:Catalytic domain of human cloned isozyme was used in the assay
Residue:459
BDBM15233
NameBDBM15233
Synonyms:4-[4-(hydroxymethyl)-1H-1,2,3-triazol-1-yl]benzene-1-sulfonamide benzene sulfonamide 17
TypeSmall organic molecule
Emp. Form.C9H10N4O3S
Mol. Mass.254.266
SMILESNS(=O)(=O)c1ccc(cc1)-n1cc(CO)nn1