Reaction Details
TargetCarbonic anhydrase 9
LigandBDBM50059078
Substrate/Competitorn/a
Meas. Tech.ChEMBL_1456926 (CHEMBL3368143)
Ki 11±n/a nM
Citation Pala, NMicheletto, LSechi, MAggarwal, MCarta, FMcKenna, RSupuran, CT Carbonic Anhydrase Inhibition with Benzenesulfonamides and Tetrafluorobenzenesulfonamides Obtained via Click Chemistry. ACS Med Chem Lett5:927-30 (2014) 
 
Carbonic anhydrase 9
Name:Carbonic anhydrase 9
Type:Enzyme
Mol. Mass.:49669.03
Organism:Homo sapiens (Human)
Description:Catalytic domain of human cloned isozyme was used in the assay
Residue:459
BDBM50059078
NameBDBM50059078
Synonyms:CHEMBL3326407
TypeSmall organic molecule
Emp. Form.C14H19N5O4S
Mol. Mass.353.397
SMILESCC(C)(C)OC(=O)NCc1cn(nn1)-c1ccc(cc1)S(N)(=O)=O