Reaction Details
TargetFocal adhesion kinase 1
LigandBDBM50059149
Substrate/Competitorn/a
Meas. Tech.ChEMBL_1460546 (CHEMBL3395578)
IC50 1050±n/a nM
Citation Dao, PSmith, NTomkiewicz-Raulet, CYen-Pon, ECamacho-Artacho, MLietha, DHerbeuval, JPCoumoul, XGarbay, CChen, H Design, synthesis, and evaluation of novel imidazo[1,2-a][1,3,5]triazines and their derivatives as focal adhesion kinase inhibitors with antitumor activity. J Med Chem58:237-51 (2015) 
 
Focal adhesion kinase 1
Name:Focal adhesion kinase 1
Type:Tyrosine-protein kinase
Mol. Mass.:119233.17
Organism:Homo sapiens (Human)
Description:Q05397
Residue:1052
BDBM50059149
NameBDBM50059149
Synonyms:CHEMBL3393279
TypeSmall organic molecule
Emp. Form.C23H21N7O4
Mol. Mass.459.4573
SMILESCOC(=O)c1ccccc1Nc1nc(Nc2ccc(CNC(=O)OC=C)cc2)n2ccnc2n1