Reaction Details
TargetMitogen-activated protein kinase 14
LigandBDBM50059177
Substrate/Competitorn/a
Meas. Tech.ChEMBL_1460844 (CHEMBL3396501)
IC50 190±n/a nM
Citation Cumming, JGDebreczeni, JÉEdfeldt, FEvertsson, EHarrison, MHoldgate, GAJames, MJLamont, SGOldham, KSullivan, JEWells, SL Discovery and characterization of MAPK-activated protein kinase-2 prevention of activation inhibitors. J Med Chem58:278-93 (2015) 
 
Mitogen-activated protein kinase 14
Name:Mitogen-activated protein kinase 14
Type:Serine/threonine-protein kinase
Mol. Mass.:41286.76
Organism:Homo sapiens (Human)
Description:Q16539
Residue:360
BDBM50059177
NameBDBM50059177
Synonyms:CHEMBL3393302
TypeSmall organic molecule
Emp. Form.C21H23N3O3S
Mol. Mass.397.491
SMILESCCCc1c(cnn1-c1ccccc1)C(=O)Nc1cc(ccc1C)S(C)(=O)=O