Reaction Details
TargetMitogen-activated protein kinase 14
LigandBDBM50059180
Substrate/Competitorn/a
Meas. Tech.ChEMBL_1460845 (CHEMBL3396502)
IC50<46±n/a nM
Citation Cumming, JGDebreczeni, JÉEdfeldt, FEvertsson, EHarrison, MHoldgate, GAJames, MJLamont, SGOldham, KSullivan, JEWells, SL Discovery and characterization of MAPK-activated protein kinase-2 prevention of activation inhibitors. J Med Chem58:278-93 (2015) 
 
Mitogen-activated protein kinase 14
Name:Mitogen-activated protein kinase 14
Type:Serine/threonine-protein kinase
Mol. Mass.:41286.76
Organism:Homo sapiens (Human)
Description:Q16539
Residue:360
BDBM50059180
NameBDBM50059180
Synonyms:CHEMBL3393299
TypeSmall organic molecule
Emp. Form.C20H21N3O2
Mol. Mass.335.3996
SMILESCCCc1c(cnn1-c1ccccc1)C(=O)Nc1cc(O)ccc1C