Reaction Details
TargetMitogen-activated protein kinase kinase kinase 12
LigandBDBM50059197
Substrate/Competitorn/a
Meas. Tech.ChEMBL_1460554 (CHEMBL3395586)
IC50 213±n/a nM
Citation Patel, SCohen, FDean, BJDe La Torre, KDeshmukh, GEstrada, AAGhosh, ASGibbons, PGustafson, AHuestis, MPLe Pichon, CELin, HLiu, WLiu, XLiu, YLy, CQLyssikatos, JPMa, CScearce-Levie, KShin, YGSolanoy, HStark, KLWang, JWang, BZhao, XLewcock, JWSiu, M Discovery of dual leucine zipper kinase (DLK, MAP3K12) inhibitors with activity in neurodegeneration models. J Med Chem58:401-18 (2015) 
 
Mitogen-activated protein kinase kinase kinase 12
Name:Mitogen-activated protein kinase kinase kinase 12
Type:PROTEIN
Mol. Mass.:93216.56
Organism:Homo sapiens (Human)
Description:ChEMBL_1460553
Residue:859
BDBM50059197
NameBDBM50059197
Synonyms:CHEMBL3393339
TypeSmall organic molecule
Emp. Form.C21H25N5O
Mol. Mass.363.4561
SMILESCCc1cc(cc(Nc2cc(ccn2)C#N)n1)C1CCN(CC1)C1COC1