Reaction Details
TargetMitogen-activated protein kinase kinase kinase 12
LigandBDBM50059193
Substrate/Competitorn/a
Meas. Tech.ChEMBL_1460553 (CHEMBL3395585)
Ki 8.0±n/a nM
Citation Patel, SCohen, FDean, BJDe La Torre, KDeshmukh, GEstrada, AAGhosh, ASGibbons, PGustafson, AHuestis, MPLe Pichon, CELin, HLiu, WLiu, XLiu, YLy, CQLyssikatos, JPMa, CScearce-Levie, KShin, YGSolanoy, HStark, KLWang, JWang, BZhao, XLewcock, JWSiu, M Discovery of dual leucine zipper kinase (DLK, MAP3K12) inhibitors with activity in neurodegeneration models. J Med Chem58:401-18 (2015) 
 
Mitogen-activated protein kinase kinase kinase 12
Name:Mitogen-activated protein kinase kinase kinase 12
Type:PROTEIN
Mol. Mass.:93216.56
Organism:Homo sapiens (Human)
Description:ChEMBL_1460553
Residue:859
BDBM50059193
NameBDBM50059193
Synonyms:CHEMBL3393336
TypeSmall organic molecule
Emp. Form.C22H26N6O
Mol. Mass.390.4814
SMILESN#Cc1ccnc(Nc2cc(cc(n2)N2CCC2)C2CCN(CC2)C2COC2)c1