Reaction Details
TargetMitogen-activated protein kinase kinase kinase 12
LigandBDBM50059216
Substrate/Competitorn/a
Meas. Tech.ChEMBL_1460553 (CHEMBL3395585)
Ki 431±n/a nM
Citation Patel, SCohen, FDean, BJDe La Torre, KDeshmukh, GEstrada, AAGhosh, ASGibbons, PGustafson, AHuestis, MPLe Pichon, CELin, HLiu, WLiu, XLiu, YLy, CQLyssikatos, JPMa, CScearce-Levie, KShin, YGSolanoy, HStark, KLWang, JWang, BZhao, XLewcock, JWSiu, M Discovery of dual leucine zipper kinase (DLK, MAP3K12) inhibitors with activity in neurodegeneration models. J Med Chem58:401-18 (2015) 
 
Mitogen-activated protein kinase kinase kinase 12
Name:Mitogen-activated protein kinase kinase kinase 12
Type:PROTEIN
Mol. Mass.:93216.56
Organism:Homo sapiens (Human)
Description:ChEMBL_1460553
Residue:859
BDBM50059216
NameBDBM50059216
Synonyms:CHEMBL3393326
TypeSmall organic molecule
Emp. Form.C21H25F3N6O2
Mol. Mass.450.4574
SMILESCC(=O)N1CCC(CC1)c1cc(Nc2cc(ccn2)C(F)(F)F)nc(n1)N1CCOCC1