Reaction Details
TargetMitogen-activated protein kinase kinase kinase 12
LigandBDBM50059249
Substrate/Competitorn/a
Meas. Tech.ChEMBL_1460553 (CHEMBL3395585)
Ki 195±n/a nM
Citation Patel, SCohen, FDean, BJDe La Torre, KDeshmukh, GEstrada, AAGhosh, ASGibbons, PGustafson, AHuestis, MPLe Pichon, CELin, HLiu, WLiu, XLiu, YLy, CQLyssikatos, JPMa, CScearce-Levie, KShin, YGSolanoy, HStark, KLWang, JWang, BZhao, XLewcock, JWSiu, M Discovery of dual leucine zipper kinase (DLK, MAP3K12) inhibitors with activity in neurodegeneration models. J Med Chem58:401-18 (2015) 
 
Mitogen-activated protein kinase kinase kinase 12
Name:Mitogen-activated protein kinase kinase kinase 12
Type:PROTEIN
Mol. Mass.:93216.56
Organism:Homo sapiens (Human)
Description:ChEMBL_1460553
Residue:859
BDBM50059249
NameBDBM50059249
Synonyms:CHEMBL3393313 | US9868720, No. 6
TypeSmall organic molecule
Emp. Form.C24H27N5O
Mol. Mass.401.5041
SMILESCCc1ccnc(Nc2cc(nc(C)n2)C2CCCN(C2)C(=O)c2ccccc2)c1