Reaction Details
TargetMitogen-activated protein kinase kinase kinase 12
LigandBDBM50059253
Substrate/Competitorn/a
Meas. Tech.ChEMBL_1460553 (CHEMBL3395585)
Ki 691±n/a nM
Citation Patel, SCohen, FDean, BJDe La Torre, KDeshmukh, GEstrada, AAGhosh, ASGibbons, PGustafson, AHuestis, MPLe Pichon, CELin, HLiu, WLiu, XLiu, YLy, CQLyssikatos, JPMa, CScearce-Levie, KShin, YGSolanoy, HStark, KLWang, JWang, BZhao, XLewcock, JWSiu, M Discovery of dual leucine zipper kinase (DLK, MAP3K12) inhibitors with activity in neurodegeneration models. J Med Chem58:401-18 (2015) 
 
Mitogen-activated protein kinase kinase kinase 12
Name:Mitogen-activated protein kinase kinase kinase 12
Type:PROTEIN
Mol. Mass.:93216.56
Organism:Homo sapiens (Human)
Description:ChEMBL_1460553
Residue:859
BDBM50059253
NameBDBM50059253
Synonyms:CHEMBL3393311 | US9868720, No. 3
TypeSmall organic molecule
Emp. Form.C23H22F3N5O
Mol. Mass.441.4489
SMILESCc1nc(Nc2ccc(cn2)C(F)(F)F)cc(n1)C1CCCN(C1)C(=O)c1ccccc1