Reaction Details
TargetMitogen-activated protein kinase 10
LigandBDBM50059190
Substrate/Competitorn/a
Meas. Tech.ChEMBL_1460562 (CHEMBL3395594)
IC50 364±n/a nM
Citation Patel, SCohen, FDean, BJDe La Torre, KDeshmukh, GEstrada, AAGhosh, ASGibbons, PGustafson, AHuestis, MPLe Pichon, CELin, HLiu, WLiu, XLiu, YLy, CQLyssikatos, JPMa, CScearce-Levie, KShin, YGSolanoy, HStark, KLWang, JWang, BZhao, XLewcock, JWSiu, M Discovery of dual leucine zipper kinase (DLK, MAP3K12) inhibitors with activity in neurodegeneration models. J Med Chem58:401-18 (2015) 
 
Mitogen-activated protein kinase 10
Name:Mitogen-activated protein kinase 10
Type:Enzyme
Mol. Mass.:52586.89
Organism:Homo sapiens (Human)
Description:n/a
Residue:464
BDBM50059190
NameBDBM50059190
Synonyms:CHEMBL3393333
TypeSmall organic molecule
Emp. Form.C23H26F2N6O
Mol. Mass.440.4889
SMILESFC1(F)CCN(C1)c1cc(cc(Nc2cc(ccn2)C#N)n1)C1CCN(CC1)C1COC1