Reaction Details
TargetAurora kinase B
LigandBDBM50277545
Substrate/Competitorn/a
Meas. Tech.ChEMBL_1460627 (CHEMBL3395868)
IC50>200±n/a nM
Citation Carry, JCClerc, FMinoux, HSchio, LMauger, JNair, AParmantier, ELe Moigne, RDelorme, CNicolas, JPKrick, AAbécassis, PYCrocq-Stuerga, VPouzieux, SDelarbre, LMaignan, SBertrand, TBjergarde, KMa, NLachaud, SGuizani, HLebel, RDoerflinger, GMonget, SPerron, SGasse, FAngouillant-Boniface, OFiloche-Rommé, BMurer, MGontier, SPrévost, CMonteiro, MLCombeau, C SAR156497, an exquisitely selective inhibitor of aurora kinases. J Med Chem58:362-75 (2015) 
 
Aurora kinase B
Name:Aurora kinase B
Type:Protein
Mol. Mass.:39327.72
Organism:Homo sapiens (Human)
Description:Q96GD4
Residue:344
BDBM50277545
NameBDBM50277545
Synonyms:4-(9-chloro-7-(2-fluoro-6-methoxyphenyl)-5H-benzo[c]pyrimido[4,5-e]azepin-2-ylamino)-2-methoxybenzoic acid CHEMBL483158 US10092556, Example MLN8237 | US9346787, MLN8237
TypeSmall organic molecule
Emp. Form.C27H20ClFN4O4
Mol. Mass.518.924
SMILESCOc1cc(Nc2ncc3CN=C(c4cc(Cl)ccc4-c3n2)c2c(F)cccc2OC)ccc1C(O)=O