Reaction Details
TargetAngiopoietin-1 receptor
LigandBDBM50059453
Substrate/Competitorn/a
Meas. Tech.ChEMBL_1460631 (CHEMBL3395872)
IC50>20000±n/a nM
Citation Carry, JCClerc, FMinoux, HSchio, LMauger, JNair, AParmantier, ELe Moigne, RDelorme, CNicolas, JPKrick, AAbécassis, PYCrocq-Stuerga, VPouzieux, SDelarbre, LMaignan, SBertrand, TBjergarde, KMa, NLachaud, SGuizani, HLebel, RDoerflinger, GMonget, SPerron, SGasse, FAngouillant-Boniface, OFiloche-Rommé, BMurer, MGontier, SPrévost, CMonteiro, MLCombeau, C SAR156497, an exquisitely selective inhibitor of aurora kinases. J Med Chem58:362-75 (2015) 
 
Angiopoietin-1 receptor
Name:Angiopoietin-1 receptor
Type:Enzyme
Mol. Mass.:125835.70
Organism:Homo sapiens (Human)
Description:Q02763
Residue:1124
BDBM50059453
NameBDBM50059453
Synonyms:CHEMBL3393455
TypeSmall organic molecule
Emp. Form.C15H13FN4O
Mol. Mass.284.2883
SMILESFc1ccccc1C1c2c[nH]nc2NC2=C1C(=O)CNC2