Reaction Details
TargetPhosphatidylinositol 4,5-bisphosphate 3-kinase catalytic subunit gamma isoform
LigandBDBM50059635
Substrate/Competitorn/a
Meas. Tech.ChEMBL_1460636 (CHEMBL3395877)
IC50 25±n/a nM
Citation Andrs, MKorabecny, JJun, DHodny, ZBartek, JKuca, K Phosphatidylinositol 3-Kinase (PI3K) and phosphatidylinositol 3-kinase-related kinase (PIKK) inhibitors: importance of the morpholine ring. J Med Chem58:41-71 (2015) 
 
Phosphatidylinositol 4,5-bisphosphate 3-kinase catalytic subunit gamma isoform
Name:Phosphatidylinositol 4,5-bisphosphate 3-kinase catalytic subunit gamma isoform
Type:Enzyme Subunit
Mol. Mass.:126470.30
Organism:Homo sapiens (Human)
Description:P48736
Residue:1102
BDBM50059635
NameBDBM50059635
Synonyms:CHEMBL3393066
TypeSmall organic molecule
Emp. Form.C17H22N8O
Mol. Mass.354.4096
SMILESCC(C)n1c(C)nc2c(nc(nc12)N1CCOCC1)-c1cnc(N)nc1