Reaction Details
TargetPhosphatidylinositol 4,5-bisphosphate 3-kinase catalytic subunit delta isoform
LigandBDBM50308767
Substrate/Competitorn/a
Meas. Tech.ChEMBL_1460637 (CHEMBL3395878)
IC50 14±n/a nM
Citation Andrs, MKorabecny, JJun, DHodny, ZBartek, JKuca, K Phosphatidylinositol 3-Kinase (PI3K) and phosphatidylinositol 3-kinase-related kinase (PIKK) inhibitors: importance of the morpholine ring. J Med Chem58:41-71 (2015) 
 
Phosphatidylinositol 4,5-bisphosphate 3-kinase catalytic subunit delta isoform
Name:Phosphatidylinositol 4,5-bisphosphate 3-kinase catalytic subunit delta isoform
Type:Enzyme Subunit
Mol. Mass.:119489.41
Organism:Homo sapiens (Human)
Description:O00329
Residue:1044
BDBM50308767
NameBDBM50308767
Synonyms:1-[4-(3-Ethyl-7-morpholin-4-yl-3H-[1,2,3]triazolo-[4,5-d]pyrimidin-5-yl)phenyl]-3-{4-[(4-methylpiperazin-1-yl)carbonyl]-phenyl}urea PKI-402
TypeSmall organic molecule
Emp. Form.C29H34N10O3
Mol. Mass.570.6455
SMILESCCn1nnc2c(nc(nc12)-c1ccc(NC(=O)Nc2ccc(cc2)C(=O)N2CCN(C)CC2)cc1)N1CCOCC1