Reaction Details
TargetDNA-dependent protein kinase catalytic subunit
LigandBDBM50098126
Substrate/Competitorn/a
Meas. Tech.ChEMBL_1460638 (CHEMBL3395879)
IC50 230±n/a nM
Citation Andrs, MKorabecny, JJun, DHodny, ZBartek, JKuca, K Phosphatidylinositol 3-Kinase (PI3K) and phosphatidylinositol 3-kinase-related kinase (PIKK) inhibitors: importance of the morpholine ring. J Med Chem58:41-71 (2015) 
 
DNA-dependent protein kinase catalytic subunit
Name:DNA-dependent protein kinase catalytic subunit
Type:Protein
Mol. Mass.:469114.78
Organism:Homo sapiens (Human)
Description:P78527
Residue:4128
BDBM50098126
NameBDBM50098126
Synonyms:2-(morpholin-4-yl)-benzo[h]chromen-4-one 2-morpholino-4H-benzo[h]chromen-4-one LY-293646
TypeSmall organic molecule
Emp. Form.C17H15NO3
Mol. Mass.281.3059
SMILESO=c1cc(oc2c3ccccc3ccc12)N1CCOCC1