Reaction Details
TargetDNA-dependent protein kinase catalytic subunit
LigandBDBM50132361
Substrate/Competitorn/a
Meas. Tech.ChEMBL_1460641 (CHEMBL3395882)
IC50 220±n/a nM
Citation Andrs, MKorabecny, JJun, DHodny, ZBartek, JKuca, K Phosphatidylinositol 3-Kinase (PI3K) and phosphatidylinositol 3-kinase-related kinase (PIKK) inhibitors: importance of the morpholine ring. J Med Chem58:41-71 (2015) 
 
DNA-dependent protein kinase catalytic subunit
Name:DNA-dependent protein kinase catalytic subunit
Type:Protein
Mol. Mass.:469114.78
Organism:Homo sapiens (Human)
Description:P78527
Residue:4128
BDBM50132361
NameBDBM50132361
Synonyms:2-(4-Methoxy-phenyl)-6-morpholin-4-yl-pyran-4-one CHEMBL319261
TypeSmall organic molecule
Emp. Form.C16H17NO4
Mol. Mass.287.3105
SMILESCOc1ccc(cc1)-c1cc(=O)cc(o1)N1CCOCC1