Reaction Details
TargetDNA-dependent protein kinase catalytic subunit
LigandBDBM50132365
Substrate/Competitorn/a
Meas. Tech.ChEMBL_1460641 (CHEMBL3395882)
IC50 280±n/a nM
Citation Andrs, MKorabecny, JJun, DHodny, ZBartek, JKuca, K Phosphatidylinositol 3-Kinase (PI3K) and phosphatidylinositol 3-kinase-related kinase (PIKK) inhibitors: importance of the morpholine ring. J Med Chem58:41-71 (2015) 
 
DNA-dependent protein kinase catalytic subunit
Name:DNA-dependent protein kinase catalytic subunit
Type:Protein
Mol. Mass.:469114.78
Organism:Homo sapiens (Human)
Description:P78527
Residue:4128
BDBM50132365
NameBDBM50132365
Synonyms:2-(4-Methoxy-phenyl)-6-morpholin-4-yl-thiopyran-4-one CHEMBL321784
TypeSmall organic molecule
Emp. Form.C16H17NO3S
Mol. Mass.303.376
SMILESCOc1ccc(cc1)-c1cc(=O)cc(s1)N1CCOCC1