Reaction Details
TargetDNA-dependent protein kinase catalytic subunit
LigandBDBM50319915
Substrate/Competitorn/a
Meas. Tech.ChEMBL_1460641 (CHEMBL3395882)
IC50 600±n/a nM
Citation Andrs, MKorabecny, JJun, DHodny, ZBartek, JKuca, K Phosphatidylinositol 3-Kinase (PI3K) and phosphatidylinositol 3-kinase-related kinase (PIKK) inhibitors: importance of the morpholine ring. J Med Chem58:41-71 (2015) 
 
DNA-dependent protein kinase catalytic subunit
Name:DNA-dependent protein kinase catalytic subunit
Type:Protein
Mol. Mass.:469114.78
Organism:Homo sapiens (Human)
Description:P78527
Residue:4128
BDBM50319915
NameBDBM50319915
Synonyms:4-morpholino-7-(thiophen-2-yl)-2H-chromen-2-one | CHEMBL1085747
TypeSmall organic molecule
Emp. Form.C17H15NO3S
Mol. Mass.313.371
SMILESO=c1cc(N2CCOCC2)c2ccc(cc2o1)-c1cccs1