Reaction Details
TargetSerine/threonine-protein kinase mTOR
LigandBDBM50308767
Substrate/Competitorn/a
Meas. Tech.ChEMBL_1460649 (CHEMBL3395890)
IC50 3.0±n/a nM
Citation Andrs, MKorabecny, JJun, DHodny, ZBartek, JKuca, K Phosphatidylinositol 3-Kinase (PI3K) and phosphatidylinositol 3-kinase-related kinase (PIKK) inhibitors: importance of the morpholine ring. J Med Chem58:41-71 (2015) 
 
Serine/threonine-protein kinase mTOR
Name:Serine/threonine-protein kinase mTOR
Type:Rapamycin target protein
Mol. Mass.:288917.12
Organism:Homo sapiens (Human)
Description:P42345
Residue:2549
BDBM50308767
NameBDBM50308767
Synonyms:1-[4-(3-Ethyl-7-morpholin-4-yl-3H-[1,2,3]triazolo-[4,5-d]pyrimidin-5-yl)phenyl]-3-{4-[(4-methylpiperazin-1-yl)carbonyl]-phenyl}urea PKI-402
TypeSmall organic molecule
Emp. Form.C29H34N10O3
Mol. Mass.570.6455
SMILESCCn1nnc2c(nc(nc12)-c1ccc(NC(=O)Nc2ccc(cc2)C(=O)N2CCN(C)CC2)cc1)N1CCOCC1