Reaction Details
TargetMitogen-activated protein kinase 10
LigandBDBM50059649
Substrate/Competitorn/a
Meas. Tech.ChEMBL_1460657 (CHEMBL3395898)
IC50 0.300000±n/a nM
Citation Koch, PGehringer, MLaufer, SA Inhibitors of c-Jun N-terminal kinases: an update. J Med Chem58:72-95 (2015) 
 
Mitogen-activated protein kinase 10
Name:Mitogen-activated protein kinase 10
Type:Enzyme
Mol. Mass.:52586.89
Organism:Homo sapiens (Human)
Description:n/a
Residue:464
BDBM50059649
NameBDBM50059649
Synonyms:CHEMBL3220493
TypeSmall organic molecule
Emp. Form.C21H21ClN6O2
Mol. Mass.424.883
SMILESNC(=O)c1ccccc1Nc1nc(Nc2ccc(cc2)N2CCOCC2)ncc1Cl