Reaction Details
TargetMitogen-activated protein kinase 10
LigandBDBM50059650
Substrate/Competitorn/a
Meas. Tech.ChEMBL_1460657 (CHEMBL3395898)
IC50 0.800000±n/a nM
Citation Koch, PGehringer, MLaufer, SA Inhibitors of c-Jun N-terminal kinases: an update. J Med Chem58:72-95 (2015) 
 
Mitogen-activated protein kinase 10
Name:Mitogen-activated protein kinase 10
Type:Enzyme
Mol. Mass.:52586.89
Organism:Homo sapiens (Human)
Description:n/a
Residue:464
BDBM50059650
NameBDBM50059650
Synonyms:CHEMBL3220495
TypeSmall organic molecule
Emp. Form.C22H23ClN6O3
Mol. Mass.454.909
SMILESCOc1cc(ccc1Nc1ncc(Cl)c(Nc2ccccc2C(N)=O)n1)N1CCOCC1