Reaction Details
TargetCasein kinase I isoform delta
LigandBDBM50059656
Substrate/Competitorn/a
Meas. Tech.ChEMBL_1460924 (CHEMBL3396744)
Kd 380±n/a nM
Citation Koch, PGehringer, MLaufer, SA Inhibitors of c-Jun N-terminal kinases: an update. J Med Chem58:72-95 (2015) 
 
Casein kinase I isoform delta
Name:Casein kinase I isoform delta
Type:Enzyme
Mol. Mass.:47356.76
Organism:Homo sapiens (Human)
Description:P48730
Residue:415
BDBM50059656
NameBDBM50059656
Synonyms:CHEMBL3393601
TypeSmall organic molecule
Emp. Form.C15H9N3O
Mol. Mass.247.2515
SMILESO\N=C1\c2ccccc2-c2nc3ccccc3nc12