Reaction Details
TargetMitogen-activated protein kinase 10
LigandBDBM50059656
Substrate/Competitorn/a
Meas. Tech.ChEMBL_1460683 (CHEMBL3396014)
Kd 100±n/a nM
Citation Koch, PGehringer, MLaufer, SA Inhibitors of c-Jun N-terminal kinases: an update. J Med Chem58:72-95 (2015) 
 
Mitogen-activated protein kinase 10
Name:Mitogen-activated protein kinase 10
Type:Enzyme
Mol. Mass.:52586.89
Organism:Homo sapiens (Human)
Description:n/a
Residue:464
BDBM50059656
NameBDBM50059656
Synonyms:CHEMBL3393601
TypeSmall organic molecule
Emp. Form.C15H9N3O
Mol. Mass.247.2515
SMILESO\N=C1\c2ccccc2-c2nc3ccccc3nc12