Reaction Details
TargetMitogen-activated protein kinase 8
LigandBDBM50059652
Substrate/Competitorn/a
Meas. Tech.ChEMBL_1460655 (CHEMBL3395896)
IC50 0.240000±n/a nM
Citation Koch, PGehringer, MLaufer, SA Inhibitors of c-Jun N-terminal kinases: an update. J Med Chem58:72-95 (2015) 
 
Mitogen-activated protein kinase 8
Name:Mitogen-activated protein kinase 8
Type:Enzyme
Mol. Mass.:48297.57
Organism:Homo sapiens (Human)
Description:JNK-1 was purchased from Upstate Cell Signaling Solutions (formerly Upstate Biotechnology).
Residue:427
BDBM50059652
NameBDBM50059652
Synonyms:CHEMBL3220502
TypeSmall organic molecule
Emp. Form.C21H19ClN6O2
Mol. Mass.422.868
SMILESNC(=O)c1ccccc1Nc1nc(Nc2ccc(cc2)N2CCCC2=O)ncc1Cl