Reaction Details
TargetProtein kinase C alpha type
LigandBDBM50059673
Substrate/Competitorn/a
Meas. Tech.ChEMBL_1460976 (CHEMBL3396875)
Ki 8.3±n/a nM
Citation Ann, JYoon, SBaek, JKim, da HLewin, NEHill, CSBlumberg, PMLee, J Design and synthesis of protein kinase C epsilon selective diacylglycerol lactones (DAG-lactones). Eur J Med Chem90:332-41 (2015) 
 
Protein kinase C alpha type
Name:Protein kinase C alpha type
Type:Enzyme
Mol. Mass.:76755.65
Organism:Homo sapiens (Human)
Description:The recombinant human PKC enzymes were produced using a baculovirus expression system in SF9 cells
Residue:672
BDBM50059673
NameBDBM50059673
Synonyms:CHEMBL3393754
TypeSmall organic molecule
Emp. Form.C29H48O5
Mol. Mass.476.6884
SMILESCCCCC\C=C/C\C=C/CCCCCCC\C=C1/CC(CO)(COC(=O)C(C)(C)C)OC1=O