Reaction Details
TargetProtein kinase C epsilon type
LigandBDBM50059676
Substrate/Competitorn/a
Meas. Tech.ChEMBL_1460982 (CHEMBL3394957)
Ki 3.0±n/a nM
Citation Ann, JYoon, SBaek, JKim, da HLewin, NEHill, CSBlumberg, PMLee, J Design and synthesis of protein kinase C epsilon selective diacylglycerol lactones (DAG-lactones). Eur J Med Chem90:332-41 (2015) 
 
Protein kinase C epsilon type
Name:Protein kinase C epsilon type
Type:Enzyme
Mol. Mass.:83680.45
Organism:Homo sapiens (Human)
Description:The recombinant human PKC enzymes were produced using a baculovirus expression system in SF9 cells
Residue:737
BDBM50059676
NameBDBM50059676
Synonyms:CHEMBL3393748
TypeSmall organic molecule
Emp. Form.C22H38O5
Mol. Mass.382.5341
SMILESCC(C)C\C=C1/CC(CO)(COC(=O)CC(CC(C)C)CC(C)C)OC1=O