Reaction Details
TargetProtein kinase C epsilon type
LigandBDBM50059668
Substrate/Competitorn/a
Meas. Tech.ChEMBL_1460977 (CHEMBL3396876)
Ki 5.9±n/a nM
Citation Ann, JYoon, SBaek, JKim, da HLewin, NEHill, CSBlumberg, PMLee, J Design and synthesis of protein kinase C epsilon selective diacylglycerol lactones (DAG-lactones). Eur J Med Chem90:332-41 (2015) 
 
Protein kinase C epsilon type
Name:Protein kinase C epsilon type
Type:Enzyme
Mol. Mass.:83680.45
Organism:Homo sapiens (Human)
Description:The recombinant human PKC enzymes were produced using a baculovirus expression system in SF9 cells
Residue:737
BDBM50059668
NameBDBM50059668
Synonyms:CHEMBL3393758
TypeSmall organic molecule
Emp. Form.C29H52O5
Mol. Mass.480.7202
\C=C1\CC(=O)OC1(CO)COC(=O)C(C)(C)C