Reaction Details
TargetProtein kinase C alpha type
LigandBDBM50059760
Substrate/Competitorn/a
Meas. Tech.ChEMBL_1460981 (CHEMBL3394956)
Ki 61±n/a nM
Citation Ann, JYoon, SBaek, JKim, da HLewin, NEHill, CSBlumberg, PMLee, J Design and synthesis of protein kinase C epsilon selective diacylglycerol lactones (DAG-lactones). Eur J Med Chem90:332-41 (2015) 
 
Protein kinase C alpha type
Name:Protein kinase C alpha type
Type:Enzyme
Mol. Mass.:76755.65
Organism:Homo sapiens (Human)
Description:The recombinant human PKC enzymes were produced using a baculovirus expression system in SF9 cells
Residue:672
BDBM50059760
NameBDBM50059760
Synonyms:CHEMBL3393752
TypeSmall organic molecule
Emp. Form.C29H44O5
Mol. Mass.472.6567
SMILESCCCCCCC#CC#CCCCCCCCC(=O)OCC1(CO)C\C(=C/CC(C)C)C(=O)O1