Reaction Details
TargetD(2) dopamine receptor
LigandBDBM50036734
Substrate/Competitorn/a
Meas. Tech.ChEMBL_1460698 (CHEMBL3396029)
Ki 71±n/a nM
Citation Sozio, PFiorito, JDi Giacomo, VDi Stefano, AMarinelli, LCacciatore, ICataldi, APacella, STurkez, HParenti, CRescifina, AMarrazzo, A Haloperidol metabolite II prodrug: asymmetric synthesis and biological evaluation on rat C6 glioma cells. Eur J Med Chem90:1-9 (2015) 
 
D(2) dopamine receptor
Name:D(2) dopamine receptor
Type:G Protein-Coupled Receptor (GPCR)
Mol. Mass.:50931.60
Organism:Rattus norvegicus (rat)
Description:P61169
Residue:444
BDBM50036734
NameBDBM50036734
Synonyms:(S)-4-(4-Chloro-phenyl)-1-[4-(4-fluoro-phenyl)-4-hydroxy-butyl]-piperidin-4-ol | CHEMBL129237
TypeSmall organic molecule
Emp. Form.C21H25ClFNO2
Mol. Mass.377.88
SMILESO[C@@H](CCCN1CCC(O)(CC1)c1ccc(Cl)cc1)c1ccc(F)cc1