Reaction Details
TargetHypoxanthine-guanine phosphoribosyltransferase
LigandBDBM50059910
Substrate/Competitorn/a
Meas. Tech.ChEMBL_1461452 (CHEMBL3396536)
Ki 30±n/a nM
Citation Keough, DTHocková, DJaneba, ZWang, THNaesens, LEdstein, MDChavchich, MGuddat, LW Aza-acyclic nucleoside phosphonates containing a second phosphonate group as inhibitors of the human, Plasmodium falciparum and vivax 6-oxopurine phosphoribosyltransferases and their prodrugs as antimalarial agents. J Med Chem58:827-46 (2015) 
 
Hypoxanthine-guanine phosphoribosyltransferase
Name:Hypoxanthine-guanine phosphoribosyltransferase
Type:Protein
Mol. Mass.:24579.61
Organism:Homo sapiens (Human)
Description:P00492
Residue:218
BDBM50059910
NameBDBM50059910
Synonyms:CHEMBL3394315
TypeSmall organic molecule
Emp. Form.C12H22N6O8P2
Mol. Mass.440.286
SMILESNc1nc2n(CCN(CCP(O)(O)=O)COCCP(O)(O)=O)cnc2c(=O)[nH]1