Reaction Details
TargetHypoxanthine-guanine phosphoribosyltransferase
LigandBDBM50059911
Substrate/Competitorn/a
Meas. Tech.ChEMBL_1461452 (CHEMBL3396536)
Ki 300±n/a nM
Citation Keough, DTHocková, DJaneba, ZWang, THNaesens, LEdstein, MDChavchich, MGuddat, LW Aza-acyclic nucleoside phosphonates containing a second phosphonate group as inhibitors of the human, Plasmodium falciparum and vivax 6-oxopurine phosphoribosyltransferases and their prodrugs as antimalarial agents. J Med Chem58:827-46 (2015) 
 
Hypoxanthine-guanine phosphoribosyltransferase
Name:Hypoxanthine-guanine phosphoribosyltransferase
Type:Protein
Mol. Mass.:24579.61
Organism:Homo sapiens (Human)
Description:P00492
Residue:218
BDBM50059911
NameBDBM50059911
Synonyms:CHEMBL3394314
TypeSmall organic molecule
Emp. Form.C13H24N6O7P2
Mol. Mass.438.3132
SMILESNc1nc2n(CCN(CCCCP(O)(O)=O)CCP(O)(O)=O)cnc2c(=O)[nH]1