Reaction Details
TargetCarbonic anhydrase 2
LigandBDBM10859
Substrate/Competitorn/a
Meas. Tech.ChEMBL_1461813 (CHEMBL3395807)
Ki 320±n/a nM
Citation Vullo, DDel Prete, SFisher, GMAndrews, KTPoulsen, SACapasso, CSupuran, CT Sulfonamide inhibition studies of theż-class carbonic anhydrase from the malaria pathogen Plasmodium falciparum. Bioorg Med Chem23:526-31 (2015) 
 
Carbonic anhydrase 2
Name:Carbonic anhydrase 2
Type:Enzyme
Mol. Mass.:29250.71
Organism:Homo sapiens (Human)
Description:P00918
Residue:260
BDBM10859
NameBDBM10859
Synonyms:4-methylbenzene-1-sulfonamide aromatic/heteroaromatic sulfonamide 4 | hCA inhibitor, 7
TypeSmall organic molecule
Emp. Form.C7H9NO2S
Mol. Mass.171.217
SMILESCc1ccc(cc1)S(N)(=O)=O