Reaction Details
TargetCarbonic anhydrase 2
LigandBDBM10868
Substrate/Competitorn/a
Meas. Tech.ChEMBL_1461813 (CHEMBL3395807)
Ki 60±n/a nM
Citation Vullo, DDel Prete, SFisher, GMAndrews, KTPoulsen, SACapasso, CSupuran, CT Sulfonamide inhibition studies of theż-class carbonic anhydrase from the malaria pathogen Plasmodium falciparum. Bioorg Med Chem23:526-31 (2015) 
 
Carbonic anhydrase 2
Name:Carbonic anhydrase 2
Type:Enzyme
Mol. Mass.:29250.71
Organism:Homo sapiens (Human)
Description:P00918
Residue:260
BDBM10868
NameBDBM10868
Synonyms:1,3,4-Thiadiazole-2-sulfonamide, 6 5-Amino-1,3,4-thiadiazole-2-sulphonamide (1) CHEMBL265674 | aromatic/heteroaromatic sulfonamide 13
TypeSmall organic molecule
Emp. Form.C2H4N4O2S2
Mol. Mass.180.209
SMILESNc1nnc(s1)S(N)(=O)=O