Reaction Details
TargetStearoyl-CoA desaturase
LigandBDBM50060654
Substrate/Competitorn/a
Meas. Tech.ChEMBL_1462110 (CHEMBL3396817)
IC50 9.0±n/a nM
Citation Sun, SZhang, ZPokrovskaia, NChowdhury, SJia, QChang, EKhakh, KKwan, RMcLaren, DGRadomski, CCRatkay, LGFu, JDales, NAWinther, MD Discovery of triazolone derivatives as novel, potent stearoyl-CoA desaturase-1 (SCD1) inhibitors. Bioorg Med Chem23:455-65 (2015) 
 
Stearoyl-CoA desaturase
Name:Stearoyl-CoA desaturase
Type:Enzyme
Mol. Mass.:41537.27
Organism:Homo sapiens (Human)
Description:O00767
Residue:359
BDBM50060654
NameBDBM50060654
Synonyms:CHEMBL3393077
TypeSmall organic molecule
Emp. Form.C18H15FN6O2S2
Mol. Mass.430.479
SMILESCc1nc(sc1C(=O)NCc1nccs1)-n1cnn(Cc2ccc(F)cc2)c1=O